{"text_format":"1","workbook":"xlsx","n_sheets":5,"sheets":["Gegevens invoeren","Berekeningen","Database","Weersgegevens","Subsidie"],"not_rendered":{"charts":1,"images":1,"macros":1,"external_links":0,"defined_names":37,"comments":0,"pivot_tables":0},"unopened":[],"bounds":{"document_bytes":16777216,"sheet_cells":100000,"rows_first":2000,"rows_last":500,"rows_between":2000,"halvings":0,"cell_chars":16384,"cell_head_chars":4096},"cells_cut":0,"cells_raw":0,"read":"whole","date_system":"1900"}

{"sheet":"Gegevens invoeren","index":0,"n_rows":34,"n_cols":12,"rows_kept":34,"cut":false,"hidden":false,"merged":[]}
["Gegevens invullen:",null,null,null,null,"Berekende waarden:"]
["Tankgegevens","Du",45,"m",null,"Warmtelek door","bodem",{"$f":"(Berekeningen!C28*Berekeningen!J9)/1000","v":63.195944935622492},"kW",null,"Inschattting stoomkosten over de opslagperiode:"]
[null,"Ti",50,"C",null,null,"natte wand",{"$f":"(Berekeningen!D28*Berekeningen!J11)/1000","v":32.437324366546889},"kW",null,null,{"$f":"(H6*24*Berekeningen!N14*3.6/Berekeningen!I16)/0.85*C23","v":40299.816517815954}]
[null,"h",15,"m",null,null,"droge wand",{"$f":"(Berekeningen!F28*Berekeningen!J12)/1000","v":1.2936240272206507},"kW"]
[null,"vulling",95,"%",null,null,"dak",{"$f":"(Berekeningen!E28*Berekeningen!J10)/1000","v":13.599482172160616},"kW"]
["wand","isolatiemateriaal","steen- of glaswol",null,null,null,"totaal",{"$f":"SUM(H2:H5)","v":110.52637550155065},"kW"]
[null,"dikte isolatie",0.1,"m"]
[null,"kleur wand","aluminium",null,null,null,"<--gebruik bij voorkeur de linkerknop"]
["dak","isolatiemateriaal","PIR",null,null,null,"de rechter is voor als de linker niet werkt."]
[null,"dikte isolatie",0.1,"m",null,null,"Wel elke keer op OK klikken na elke sol-"]
[null,"dikte afdekmateriaal",0,"m",null,null,"verstap!"]
[null,"kleur dak","witte verf",null,null,"Resultaat:"]
[null,"vorm dak","conisch",null,null,{"$f":"IF(SUM(Berekeningen!D30:F30)<0.001,\"Berekening succesvol uitgevoerd\",\"Berekening mislukt, probeer nogmaals of probeer de tweede knop\")","v":"Berekening succesvol uitgevoerd"}]
["bodem (tot 1 m diep)","zand",0.85,"m"]
[null,"klei",0.15,"m"]
[null,"beton",0,"m"]
[null,"foamglas",0,"m"]
[null,"zandbitumen",0,"m"]
["opslagperiode","van","2013-01-01"]
[null,"tot en met","2013-12-31"]
["weersgegevens","weerstation","Rotterdam"]
["stoomgegevens","druk",8,"barg"]
[null,"prijs",20,"€/ton"]
["aannames","dikte staal",0.01,"m"]
[null,"bodemtemperatuur",12.5,"C"]
[]
[]
["Opgezochte waarden:"]
["u",{"$f":"Berekeningen!L7","v":4.3589389799635709},"gemiddelde over 15 jaren"]
["Tu",{"$f":"Berekeningen!L6","v":10.793155737704909},"gemiddelde over 15 jaren"]
["k isolatie wand",{"$f":"VLOOKUP(C6,k_waarden,2,FALSE)+C31","v":4.3000000000000003E-2},{"$f":"IF(C6=\"PIR\",(C3-10)/10*0.0007,IF(C6=\"PUR\",(C3-10)/10*0.0007,(C3-10)/10*0.002))","v":8.0000000000000002E-3},"(correctie)"]
["k isolatie dak",{"$f":"VLOOKUP(C9,k_waarden,2,FALSE)+C32","v":2.58E-2},{"$f":"IF(C9=\"PIR\",(C3-10)/10*0.0007,IF(C9=\"PUR\",(C3-10)/10*0.0007,(C3-10)/10*0.002))","v":2.8E-3},"(correctie)"]
["emissiefactor wand",{"$f":"VLOOKUP(C8,emissiefactor,2,FALSE)","v":0.33}]
["emissiefactor dak",{"$f":"VLOOKUP(C12,emissiefactor,2,FALSE)","v":0.9}]

{"sheet":"Berekeningen","index":1,"n_rows":30,"n_cols":17,"rows_kept":30,"cut":false,"hidden":false,"merged":[]}
["Berekeningen",null,null,null,null,null,null,"Andere hulpwaarden"]
[null,null,"Bodem","Natte wand","Dak","Droge wand",null,"datum",{"$f":"MONTH('Gegevens invoeren'!C19)","v":1},{"$f":"DAY('Gegevens invoeren'!C19)","v":1},{"$f":"IF(LEN(I2)=1,CONCATENATE(0,I2),I2)","v":"01"},{"$f":"IF(LEN(J2)=1,CONCATENATE(0,J2),J2)","v":"01"},{"$f":"CONCATENATE('Gegevens invoeren'!C21,K2,L2)","v":"Rotterdam0101"},"langer dan een jaar?",null,{"$f":"IF(DAYS360('Gegevens invoeren'!C19,'Gegevens invoeren'!C20)>360,\"ja\",\"nee\")","v":"nee"},{"$f":"ROUNDDOWN(DAYS360('Gegevens invoeren'!C19,'Gegevens invoeren'!C20)/360,0)","v":1}]
["Afhankelijke waarden","vouw in",null,null,{"$f":"HLOOKUP(ROUND(E13,-1),nweluchtinfo,5,FALSE)","v":1.8335E-5},null,null,null,{"$f":"MONTH('Gegevens invoeren'!C20)","v":12},{"$f":"DAY('Gegevens invoeren'!C20)","v":31},{"$f":"IF(LEN(I3)=1,CONCATENATE(0,I3),I3)","v":12},{"$f":"IF(LEN(J3)=1,CONCATENATE(0,J3),J3)","v":31},{"$f":"CONCATENATE('Gegevens invoeren'!C21,K3,L3)","v":"Rotterdam1231"},"jaaroverschrijdend?",null,{"$f":"IF(YEAR('Gegevens invoeren'!C20)>YEAR('Gegevens invoeren'!C19),\"ja\",\"nee\")","v":"nee"}]
[null,"vouw uit",null,{"$f":"HLOOKUP(ROUND(D25,-1),nweluchtinfo,5,FALSE)","v":1.4535000000000001E-5},{"$f":"HLOOKUP(ROUND(E25,-1),nweluchtinfo,5,FALSE)","v":1.4535000000000001E-5},{"$f":"HLOOKUP(ROUND(F25,-1),nweluchtinfo,5,FALSE)","v":1.4535000000000001E-5}]
[null,"Pr in",null,null,{"$f":"HLOOKUP(ROUND(E13,-1),nweluchtinfo,4,FALSE)","v":0.7310051016850222},null,null,null,null,null,null,"rekenwaarde","<j","<j jaaroverschrijdend",">j","jaargem"]
[null,"Pr uit",null,{"$f":"HLOOKUP(ROUND(D25,-1),nweluchtinfo,4,FALSE)","v":0.74367313104333566},{"$f":"HLOOKUP(ROUND(E25,-1),nweluchtinfo,4,FALSE)","v":0.74367313104333566},{"$f":"HLOOKUP(ROUND(F25,-1),nweluchtinfo,4,FALSE)","v":0.74367313104333566},null,"weer",null,null,"gemiddelde temp",{"$f":"IF(P2=\"ja\",O6,IF(P3=\"ja\",N6,M6))","v":10.793155737704909},{"$f":"AVERAGEIFS(temperatuur,key,\">=\"&M2,key,\"<=\"&M3)","v":10.793155737704909},{"$f":"N10/N12*AVERAGEIFS(temperatuur,key,\">=\"&M2,key,\"<=\"&'Gegevens invoeren'!C21&\"1231\")+N11/N12*AVERAGEIFS(temperatuur,key,\">=\"&'Gegevens invoeren'!C21&\"0101\",key,\"<=\"&M3)","v":7.2019963536918814},{"$f":"N10/N12*AVERAGEIFS(temperatuur,key,\">=\"&M2,key,\"<=\"&'Gegevens invoeren'!C21&\"1231\")+N11/N12*AVERAGEIFS(temperatuur,key,\">=\"&'Gegevens invoeren'!C21&\"0101\",key,\"<=\"&M3)+Q2*365/N12*P6","v":10.793155737704909},{"$f":"AVERAGEIFS(temperatuur,key,\">=\"&'Gegevens invoeren'!C21&\"0101\",key,\"<=\"&'Gegevens invoeren'!C21&\"1231\")","v":10.793155737704909}]
[null,"k in",null,null,{"$f":"HLOOKUP(ROUND(E13,-1),nweluchtinfo,6,FALSE)","v":2.7920999999999998E-2},null,null,null,null,null,"gemiddelde wind",{"$f":"IF(P2=\"ja\",O7,IF(P3=\"ja\",N7,M7))","v":4.3589389799635709},{"$f":"AVERAGEIFS(wind,key,\">=\"&M2,key,\"<=\"&M3)","v":4.3589389799635709},{"$f":"N10/N12*AVERAGEIFS(wind,key,\">=\"&M2,key,\"<=\"&'Gegevens invoeren'!C21&\"1231\")+N11/N12*AVERAGEIFS(wind,key,\">=\"&'Gegevens invoeren'!C21&\"0101\",key,\"<=\"&M3)","v":2.9086083257368585},{"$f":"N10/N12*AVERAGEIFS(wind,key,\">=\"&M2,key,\"<=\"&'Gegevens invoeren'!C21&\"1231\")+N11/N12*AVERAGEIFS(wind,key,\">=\"&'Gegevens invoeren'!C21&\"0101\",key,\"<=\"&M3)+Q2*365/N12*P7","v":4.3589389799635709},{"$f":"AVERAGEIFS(wind,key,\">=\"&'Gegevens invoeren'!C21&\"0101\",key,\"<=\"&'Gegevens invoeren'!C21&\"1231\")","v":4.3589389799635709}]
[null,"k uit",null,{"$f":"HLOOKUP(ROUND(D25,-1),nweluchtinfo,6,FALSE)","v":2.4840999999999998E-2},{"$f":"HLOOKUP(ROUND(E25,-1),nweluchtinfo,6,FALSE)","v":2.4840999999999998E-2},{"$f":"HLOOKUP(ROUND(F25,-1),nweluchtinfo,6,FALSE)","v":2.4840999999999998E-2}]
["Berekende waarden","Lc",null,null,{"$f":"(1-'Gegevens invoeren'!C5/100)*'Gegevens invoeren'!C4","v":0.75000000000000067},null,null,"oppervlakten","bodem",{"$f":"0.25*PI()*'Gegevens invoeren'!C2^2","v":1590.4312808798327},"m2",null,"weegfactoren weer"]
[null,"beta",null,null,{"$f":"1/(273+E13)","v":3.1271083427457571E-3},null,null,null,"dak",{"$f":"VLOOKUP('Gegevens invoeren'!C13,dak,2,FALSE)*J9","v":1646.0963757106267},"m2",null,"deel 1",{"$f":"COUNTIFS(key,\">=\"&M2,key,\"<=\"&'Gegevens invoeren'!C21&\"1231\")","v":366}]
[null,"Rtotaal",{"$f":"'Gegevens invoeren'!C14/VLOOKUP('Gegevens invoeren'!B14,k_waarden,2,FALSE)+'Gegevens invoeren'!C15/VLOOKUP('Gegevens invoeren'!B15,k_waarden,2,FALSE)+'Gegevens invoeren'!C16/VLOOKUP('Gegevens invoeren'!B16,k_waarden,2,FALSE)+'Gegevens invoeren'!C17/VLOOKUP('Gegevens invoeren'!B17,k_waarden,2,FALSE)+'Gegevens invoeren'!C18/VLOOKUP('Gegevens invoeren'!B18,k_waarden,2,FALSE)","v":0.94374999999999998},{"$f":"'Gegevens invoeren'!C7/'Gegevens invoeren'!B31+'Gegevens invoeren'!C24/Database!I13","v":2.3257813953488373},{"$f":"'Gegevens invoeren'!C24/Database!I13+'Gegevens invoeren'!C10/'Gegevens invoeren'!B32","v":3.8761689922480622},{"$f":"'Gegevens invoeren'!C7/'Gegevens invoeren'!B31+'Gegevens invoeren'!C24/Database!I13","v":2.3257813953488373},null,null,"natte wand",{"$f":"PI()*'Gegevens invoeren'!C2*'Gegevens invoeren'!C4*'Gegevens invoeren'!C5/100","v":2014.546289114455},"m2",null,"deel 2",{"$f":"COUNTIFS(key,\">=\"&'Gegevens invoeren'!C21&\"0101\",key,\"<=\"&M3)","v":366}]
[null,"Rcyl",null,null,null,null,null,null,"droge wand",{"$f":"PI()*'Gegevens invoeren'!C2*'Gegevens invoeren'!C4*(1-'Gegevens invoeren'!C5/100)","v":106.02875205865563},"m2",null,"totaal aant dagen",{"$f":"SUM(N10:N11)+Q2*365","v":1097}]
["Vrije convectie","Td",null,null,{"$f":"AVERAGE('Gegevens invoeren'!C3,E21)","v":46.784251261966219}]
[null,"Ra",null,null,{"$f":"E5*9.81*E10*('Gegevens invoeren'!C3-E21)*E9^3/E3^2","v":180994929.56735358},null,null,"starttemperatuur",{"$f":"(D21-'Gegevens invoeren'!B30)/2","v":19.603422131147546},null,null,null,"echt aantal dagen",{"$f":"'Gegevens invoeren'!C20-'Gegevens invoeren'!C19","v":364}]
[null,"Nu",null,null,{"$f":"0.061*E14^(1/3)","v":34.505260027824676}]
[null,"h in",null,null,{"$f":"E15*E7/E9","v":1.2845618203158558},{"$f":"E16","v":1.2845618203158558},null,"stoomgegevens",{"$f":"VLOOKUP(('Gegevens invoeren'!C22+1),stoomgegevens,4,TRUE)","v":2029.5},"kJ/kg","verdampingswarmte"]
["Gedwongen convectie","Re",null,{"$f":"'Gegevens invoeren'!B29*'Gegevens invoeren'!C2/D4","v":13495167.120630249},{"$f":"'Gegevens invoeren'!B29*E20/E4","v":10599079.47128463},{"$f":"'Gegevens invoeren'!B29*'Gegevens invoeren'!C2/F4","v":13495167.120630249}]
[null,"Nu",null,{"$f":"0.3+0.62*D17^0.5*D6^(1/3)/(1+(0.4/D6)^(2/3))^0.25*(1+(D17/282000)^(5/8))^(4/5)","v":13462.639684157279},{"$f":"(0.037*E17^0.8-871)*E6^(1/3)","v":13192.048412676026},{"$f":"0.3+0.62*F17^0.5*F6^(1/3)/(1+(0.4/F6)^(2/3))^0.25*(1+(F17/282000)^(5/8))^(4/5)","v":13462.639684157279}]
[null,"h uit",null,{"$f":"D18*D8/'Gegevens invoeren'!C2","v":7.431676275425577},{"$f":"E18*E8/E20","v":9.2721172773399676},{"$f":"F18*F8/'Gegevens invoeren'!C2","v":7.431676275425577}]
[null,"Lgem=opp/D",null,null,{"$f":"0.25*PI()*'Gegevens invoeren'!C2","v":35.342917352885173}]
[null,"T1",null,{"$f":"'Gegevens invoeren'!C3","v":50},43.568502523932445,40.502060175508575]
[null,"T2",null,{"$f":"D21-D29*'Gegevens invoeren'!C24/Database!I13","v":49.996779666424949},{"$f":"E21-E29*'Gegevens invoeren'!C24/50","v":43.566850192751133}]
[null,"T3",null,{"$f":"D21-D28*D11","v":12.551306994403802},{"$f":"E21-E27*E11","v":11.544927304284386},{"$f":"F21-F27*F11","v":12.125920339196941}]
[null,"T4",null,12.551306994403799,{"$f":"E23-E27*'Gegevens invoeren'!C11/237","v":11.544927304284386}]
[null,"Tf",null,{"$f":"(D24+'Gegevens invoeren'!B30)/2","v":11.672231366054355},{"$f":"(E24+'Gegevens invoeren'!B30)/2","v":11.169041520994647},{"$f":"(F23+'Gegevens invoeren'!B30)/2","v":11.459538038450926}]
[null,"geldig?",null,{"$f":"IF(D17*D6>0.2,1,0)","v":1},{"$f":"IF(E17>500000,IF(E14>320000,1,0),0)","v":1},{"$f":"E26*D26","v":1}]
["W/m2","q in",null,null,{"$f":"E16*('Gegevens invoeren'!C3-E21)","v":8.2616561052141702},{"$f":"F16*('Gegevens invoeren'!C3-F21)","v":12.200690870199164}]
["W/m2","q wand",{"$f":"1/C11*('Gegevens invoeren'!C3-'Gegevens invoeren'!C25)","v":39.735099337748345},{"$f":"1/D11*('Gegevens invoeren'!C3-D24)","v":16.101553258826105},{"$f":"1/E11*(E21-E23)","v":8.2616561052141702},{"$f":"1/F11*(F21-F23)","v":12.200690870199166}]
["W/m2","q uit",null,{"$f":"D19*(D24-'Gegevens invoeren'!B30)+0.0000000567*'Gegevens invoeren'!B33*((273+D24)^4-(273+'Gegevens invoeren'!B30)^4)","v":16.10166787526768},{"$f":"E19*(E23-'Gegevens invoeren'!B30)+0.0000000567*'Gegevens invoeren'!B33*((273+E23)^4-(273+'Gegevens invoeren'!B30)^4)","v":8.2616559065740258},{"$f":"F19*(F23-'Gegevens invoeren'!B30)+0.0000000567*'Gegevens invoeren'!B33*((273+F23)^4-(273+'Gegevens invoeren'!B30)^4)","v":12.200687970483724}]
[null,null,null,{"$f":"D28-D29","v":-1.1461644157506612E-4},{"$f":"E28-E29","v":1.9864014433323973E-7},{"$f":"F28-F29","v":2.8997154419840854E-6}]

{"sheet":"Database","index":2,"n_rows":57,"n_cols":25,"rows_kept":57,"cut":false,"hidden":false,"merged":[]}
["Tankgegevens",null,null,null,null,"Weersstation",null,"thermofysische eigenschappen"]
["isolatie","kleur","dak","factor",null,null,null,null,"k",null,"emissiefactor"]
["steen- of glaswol","wit","dome",1.0720000000000001,null,"De Bilt",null,"steen- of glaswol",{"$f":"0.035","v":3.5000000000000003E-2},null,"witte verf",0.9]
["PIR","aluminium","conisch",1.0349999999999999,null,"De Kooy",null,"PUR",0.03,null,"aluminium verf",0.45]
["PUR","zwart","plat",1,null,"Deelen",null,"PIR",2.3E-2,null,"aluminium",0.33]
["isolerende verf","roestbruin",null,null,null,"Eindhoven",null,"RVS",16,null,"staal verroest",0.81]
[null,null,null,null,null,"Lauwersoog",null,"alu",237,null,"staal",0.32]
[null,null,null,null,null,"Leeuwarden",null,"zand",1,null,"zwarte verf",0.98]
[null,null,null,null,null,"Maastricht",null,"beton",1.9,null,"isolerende verf",0.85]
[null,null,null,null,null,"Rotterdam",null,"zandbitumen",0.6,null,"RVS",0.75]
[null,null,null,null,null,"Twenthe",null,"klei",1.6]
[null,null,null,null,null,"Vlissingen",null,"foamglas",4.4999999999999998E-2]
[null,null,null,null,null,null,null,"staal",50]
[null,null,null,null,null,null,null,"aluminium",237]
["Luchtgegevens",null,null,null,null,null,null,"isolerende verf",0.05]
[]
[null,-10,0,10,20,30,40,50,60,70,80,90,100,110,120,130,140,150,160,170,180,190,200,210,220]
[null,{"$f":"B17+273","v":263},273,283,293,303,313,323,333,343,353,363,373,383,393,403,413,423,433,443,453,463,473,483,493]
["rho",{"$f":" -(1.39-0.995)/100*B18+2.38","v":1.3411500000000003},1.3016500000000002,1.2621500000000003,1.2226500000000002,1.1831500000000004,1.1436500000000003,1.1041500000000004,1.0646500000000003,1.0251500000000004,0.98565000000000036,0.94615000000000049,0.9066500000000004,0.86715000000000031,0.82765000000000044,0.78815000000000035,0.74865000000000048,0.70915000000000039,0.66965000000000052,0.63015000000000043,{"$f":" -(1.39-0.995)/100*U18+2.38","v":0.59065000000000056},{"$f":" -(1.39-0.995)/100*V18+2.38","v":0.55115000000000047},{"$f":" -(1.39-0.995)/100*W18+2.38","v":0.5116500000000006},{"$f":" -(1.39-0.995)/100*X18+2.38","v":0.47215000000000051},{"$f":" -(1.39-0.995)/100*Y18+2.38","v":0.43265000000000065}]
["Pr",{"$f":"B21*B19*B24/B22","v":0.73188753913126048},{"$f":"C21*C19*C24/C22","v":0.7395294733506087},0.74367313104333566,0.74463140408310879,0.74268065400089101,0.73806589197165873,0.7310051016850222,{"$f":"I21*I19*I24/I22","v":0.72169286612082206},{"$f":"J21*J19*J24/J22","v":0.71030342558288928},{"$f":"K21*K19*K24/K22","v":0.69699326839411535},0.68190333550683846,0.66516090452842236,0.64688120626279155,0.62716881704909822,0.60611886235578505,0.5838180608209953,0.5603456328822185,0.53577409405134535,0.51016994956668305,0.48359430443627932,0.45610340065624938,0.42774909154879576,0.39857926164229307,0.36863819925075031]
["vouw",{"$f":" (0.0000209-0.0000114)/100*B18-0.00001235","v":1.2635000000000002E-5},1.3585000000000001E-5,1.4535000000000001E-5,1.5484999999999998E-5,1.6435000000000001E-5,1.7385000000000004E-5,1.8335E-5,1.9285000000000003E-5,2.0234999999999999E-5,2.1185000000000001E-5,2.2134999999999997E-5,2.3085E-5,2.4034999999999996E-5,2.4984999999999999E-5,2.5935000000000002E-5,2.6884999999999998E-5,2.7835E-5,2.8784999999999996E-5,2.9734999999999999E-5,{"$f":" (0.0000209-0.0000114)/100*U18-0.00001235","v":3.0685000000000002E-5},{"$f":" (0.0000209-0.0000114)/100*V18-0.00001235","v":3.1634999999999998E-5},{"$f":" (0.0000209-0.0000114)/100*W18-0.00001235","v":3.2585000000000001E-5},{"$f":" (0.0000209-0.0000114)/100*X18-0.00001235","v":3.3534999999999997E-5},{"$f":" (0.0000209-0.0000114)/100*Y18-0.00001235","v":3.4484999999999999E-5}]
["k",{"$f":" (0.03-0.0223)/100*B18+0.00305","v":2.3300999999999999E-2},2.4070999999999999E-2,2.4840999999999998E-2,2.5610999999999998E-2,2.6380999999999998E-2,2.7150999999999998E-2,2.7920999999999998E-2,2.8690999999999998E-2,2.9460999999999998E-2,3.0230999999999997E-2,3.1000999999999997E-2,3.1770999999999994E-2,3.2540999999999994E-2,3.3310999999999993E-2,3.4080999999999993E-2,3.4850999999999993E-2,3.5620999999999993E-2,3.6390999999999993E-2,3.7160999999999993E-2,{"$f":" (0.03-0.0223)/100*U18+0.00305","v":3.7930999999999993E-2},{"$f":" (0.03-0.0223)/100*V18+0.00305","v":3.8700999999999992E-2},{"$f":" (0.03-0.0223)/100*W18+0.00305","v":3.9470999999999992E-2},{"$f":" (0.03-0.0223)/100*X18+0.00305","v":4.0240999999999992E-2},{"$f":" (0.03-0.0223)/100*Y18+0.00305","v":4.1010999999999992E-2}]
["Cp",{"$f":" (1.009-1.006)/100*B18+0.9985","v":1.0063899999999997},{"$f":" (1.009-1.006)/100*C18+0.9985","v":1.0066899999999999},1.0069899999999998,1.0072899999999998,1.0075899999999998,1.0078899999999997,1.0081899999999997,{"$f":" (1.009-1.006)/100*I18+0.9985","v":1.0084899999999997},{"$f":" (1.009-1.006)/100*J18+0.9985","v":1.0087899999999996},{"$f":" (1.009-1.006)/100*K18+0.9985","v":1.0090899999999996},{"$f":" (1.009-1.006)/100*L18+0.9985","v":1.0093899999999996},{"$f":" (1.009-1.006)/100*M18+0.9985","v":1.0096899999999998},1.0099899999999997,1.0102899999999997,1.0105899999999997,1.0108899999999996,1.0111899999999996,1.0114899999999996,1.0117899999999995,{"$f":" (1.009-1.006)/100*U18+0.9985","v":1.0120899999999995},{"$f":" (1.009-1.006)/100*V18+0.9985","v":1.0123899999999995},{"$f":" (1.009-1.006)/100*W18+0.9985","v":1.0126899999999996},{"$f":" (1.009-1.006)/100*X18+0.9985","v":1.0129899999999996},{"$f":" (1.009-1.006)/100*Y18+0.9985","v":1.0132899999999996}]
["Cp in J/kgK",{"$f":"B23*1000","v":1006.3899999999996},1006.6899999999998,1006.9899999999998,1007.2899999999998,1007.5899999999998,1007.8899999999998,1008.1899999999997,1008.4899999999997,1008.7899999999996,1009.0899999999996,1009.3899999999995,1009.6899999999997,1009.9899999999997,1010.2899999999997,1010.5899999999997,1010.8899999999996,1011.1899999999996,1011.4899999999996,1011.7899999999995,1012.0899999999995,1012.3899999999994,1012.6899999999996,1012.9899999999997,1013.2899999999996]
[]
[]
["Stoomgegevens"]
[null,"Temperatuur"]
["Absolute","verzadigde","Vloeistof","Verdampings","Totale","Soortelijk"]
["druk","stoom","warmte","warmte","warmte","volume"]
["Bar","°C","kJ/kg","kJ/kg","kJ/kg","m3/kg"]
[6.6,162.6,686.78,2072.6999999999998,2759.5,0.28799999999999998]
[6.8,163.79,691.98,2068.8000000000002,"2.760.8",0.28000000000000003]
[7,164.96,697.06,2064.9,2762,0.27300000000000002]
[7.2,166.1,702.03,2061.1,2763.2,0.26600000000000001]
[7.4,167.21,706.9,2057.4,2764.3,0.25900000000000001]
[7.6,168.3,711.68,2053.6999999999998,2765.4,0.252]
[7.8,169.37,716.35,2050.1,2766.4,0.246]
[8,170.41,720.94,2046.5,2767.5,0.24]
[8.1999999999999993,171.44,725.43,2043,2768.5,0.23499999999999999]
[8.4,172.45,729.85,2039.6,2769.4,0.22900000000000001]
[8.6,173.44,734.19,2036.2,2770.4,0.224]
[8.8000000000000007,174.41,738.45,2032.8,2771.3,0.22]
[9,175.36,742.64,2029.5,2772.1,0.215]
[9.1999999999999993,176.29,746.76,2026.2,2773,0.21]
[9.4,177.21,750.82,2023,2773.8,0.20599999999999999]
[9.6,178.12,754.81,2019.8,2774.6,0.20200000000000001]
[9.8000000000000007,179.01,758.74,2016.7,2775.4,0.19800000000000001]
[10,179.88,762.61,2013.6,2776.2,0.19400000000000001]
[10.5,182.02,772.03,2005.9,2778,0.186]
[11,184.07,781.13,1998.5,2779.7,0.17699999999999999]
[11.5,186.05,789.92,1991.3,2781.3,0.17]
[12,187.96,798.43,1984.3,2782.7,0.16300000000000001]
[12.5,189.81,806.69,1977.4,2784.1,0.157]
[13,191.61,814.7,1970.7,2785.4,0.151]
[13.5,193.35,822.49,1964.2,2786.6,0.14599999999999999]
[14,195.04,830.08,1957.7,2787.8,0.14099999999999999]

{"sheet":"Weersgegevens","index":3,"n_rows":3662,"n_cols":7,"rows_kept":3662,"cut":false,"hidden":false,"merged":[]}
["# BRON: KONINKLIJK NEDERLANDS METEOROLOGISCH INSTITUUT (KNMI)",null,null,null,null,null,"Gemiddelde van 2000 t/m 2014. Voor meer weergegevens zie: http://www.knmi.nl/klimatologie/daggegevens/selectie.cgi"]
["key","Station","maand","dag","wind","temperatuur"]
["De Bilt0101","De Bilt","01","01",4.0133333333333336,4.1333333333333337]
["De Bilt0102","De Bilt","01","02",3.746666666666667,3.8333333333333335]
["De Bilt0103","De Bilt","01","03",4.3,3.2333333333333334]
["De Bilt0104","De Bilt","01","04",4.6466666666666656,3.8533333333333331]
["De Bilt0105","De Bilt","01","05",4.2799999999999994,3.58]
["De Bilt0106","De Bilt","01","06",3.7400000000000007,4.246666666666667]
["De Bilt0107","De Bilt","01","07",4.12,4.5199999999999996]
["De Bilt0108","De Bilt","01","08",4.4266666666666667,3.9666666666666668]
["De Bilt0109","De Bilt","01","09",3.9999999999999996,3.1333333333333337]
["De Bilt0110","De Bilt","01","10",3.8133333333333335,3.1533333333333333]
["De Bilt0111","De Bilt","01","11",4.3000000000000007,3.8866666666666663]
["De Bilt0112","De Bilt","01","12",4.1999999999999993,3.5599999999999996]
["De Bilt0113","De Bilt","01","13",4.4066666666666663,4.0733333333333333]
["De Bilt0114","De Bilt","01","14",3.5333333333333332,3.5399999999999996]
["De Bilt0115","De Bilt","01","15",4.0733333333333333,2.9799999999999995]
["De Bilt0116","De Bilt","01","16",3.9133333333333336,3.1133333333333337]
["De Bilt0117","De Bilt","01","17",4.1066666666666665,4.0733333333333341]
["De Bilt0118","De Bilt","01","18",4.3733333333333331,4.3]
["De Bilt0119","De Bilt","01","19",4.22,4.9333333333333336]
["De Bilt0120","De Bilt","01","20",4.84,5.0999999999999996]
["De Bilt0121","De Bilt","01","21",4.1866666666666665,4.6266666666666669]
["De Bilt0122","De Bilt","01","22",3.9866666666666668,3.46]
["De Bilt0123","De Bilt","01","23",3.7266666666666661,2.7266666666666666]
["De Bilt0124","De Bilt","01","24",3.1733333333333333,2.5933333333333333]
["De Bilt0125","De Bilt","01","25",3.6599999999999997,1.9599999999999997]
["De Bilt0126","De Bilt","01","26",4.2466666666666661,2.4666666666666668]
["De Bilt0127","De Bilt","01","27",3.7866666666666666,3.226666666666667]
["De Bilt0128","De Bilt","01","28",4.3933333333333326,3.5200000000000009]
["De Bilt0129","De Bilt","01","29",4.1933333333333334,3.3533333333333326]
["De Bilt0130","De Bilt","01","30",3.6933333333333329,3.5066666666666668]
["De Bilt0131","De Bilt","01","31",4.7666666666666657,3.2800000000000002]
["De Bilt0201","De Bilt","02","01",4.6466666666666674,3.2066666666666666]
["De Bilt0202","De Bilt","02","02",4.4799999999999995,3.8266666666666671]
["De Bilt0203","De Bilt","02","03",3.74,4.04]
["De Bilt0204","De Bilt","02","04",4.3933333333333326,4.7799999999999985]
["De Bilt0205","De Bilt","02","05",4.8666666666666663,5.3533333333333344]
["De Bilt0206","De Bilt","02","06",4.1733333333333338,4.7333333333333325]
["De Bilt0207","De Bilt","02","07",4.24,4.0733333333333341]
["De Bilt0208","De Bilt","02","08",4.3266666666666671,3.8066666666666658]
["De Bilt0209","De Bilt","02","09",4.1466666666666665,3.226666666666667]
["De Bilt0210","De Bilt","02","10",4.12,3.2]
["De Bilt0211","De Bilt","02","11",4.0133333333333328,3.813333333333333]
["De Bilt0212","De Bilt","02","12",4.0733333333333333,3.7533333333333334]
["De Bilt0213","De Bilt","02","13",3.3133333333333335,3.4800000000000009]
["De Bilt0214","De Bilt","02","14",3.4666666666666672,3.08]
["De Bilt0215","De Bilt","02","15",3.8266666666666671,3.9133333333333331]
["De Bilt0216","De Bilt","02","16",3.5133333333333332,3.4133333333333336]
["De Bilt0217","De Bilt","02","17",2.9666666666666672,3.0533333333333332]
["De Bilt0218","De Bilt","02","18",3.0599999999999996,3.2466666666666675]
["De Bilt0219","De Bilt","02","19",3.813333333333333,3.4933333333333327]
["De Bilt0220","De Bilt","02","20",3.8600000000000003,3.2]
["De Bilt0221","De Bilt","02","21",3.9333333333333331,3.2800000000000002]
["De Bilt0222","De Bilt","02","22",4.58,3.9400000000000004]
["De Bilt0223","De Bilt","02","23",3.9533333333333331,3.9533333333333336]
["De Bilt0224","De Bilt","02","24",3.813333333333333,4.58]
["De Bilt0225","De Bilt","02","25",3.7200000000000006,4.5666666666666664]
["De Bilt0226","De Bilt","02","26",4.2666666666666666,5.2333333333333334]
["De Bilt0227","De Bilt","02","27",4.2666666666666666,4.5466666666666669]
{"$rows_left_out":3603}
{"sheet":"Subsidie","index":4,"n_rows":12,"n_cols":7,"rows_kept":12,"cut":false,"hidden":false,"merged":[]}
[]
[]
[]
[]
[]
[null,null,"besparing tussen 0,6 en 1,5 Nm3/j per euro?",null,null,null,{"$f":"IF(F12>=0.6,IF(F12<=1.5,\"ja\",\"nee\"),\"nee\")","v":"ja"}]
[null,null,"prijs ",80,"€/m2","--->",{"$f":"D7*Berekeningen!J10","v":131687.71005685013}]
[null,null,"warmtelek zonder dakisolatie",null,null,268.40863490964659,"kW"]
[null,null,"warmtelek met dakisolatie",null,null,120.18898849659911,"kW"]
[null,null,null,"besparing",null,{"$f":"F8-F9","v":148.21964641304749},"kW"]
[null,null,null,"aardgaseq per jaar:",null,{"$f":"F10*24*365*3.6/31.65","v":147685.77470084882},"Nm3/j"]
[null,null,null,null,null,{"$f":"F11/G7","v":1.1214848723323707}]